BDBM50466892 CHEMBL4283871
SMILES O=C(Nc1ccc2[nH]cc(C3CCN(CC3)C(=O)C3CCCC3)c2c1)c1cccc(c1)C#N
InChI Key InChIKey=HDYDGYGIQGBWPQ-UHFFFAOYSA-N
Data  1 KI  7 IC50
  Tab Delimited (TSV)   2D SDfile   Computed 3D by Vconf -m prep SDfile
Find this compound or compounds like it in BindingDB:
Activity Spreadsheet -- Enzyme Inhibition Constant Data from BindingDB
Found 2 hits for monomerid = 50466892
TargetNuclear receptor ROR-alpha(Homo sapiens (Human))
Karo Pharma
Curated by ChEMBL
LigandPNGBDBM50466892(CHEMBL4283871)
Affinity DataIC50: >3.00E+4nM. Assay description: Inverse agonist activity at RORA (unknown origin) assessed as inhibition of biotinylated co-activator SRC1-2 peptide recruitment after 3 hrs by TR-FR...
Ligand InfoPC cidPC sid
In DepthDetails ArticlePubMed
TargetNuclear receptor ROR-alpha(Homo sapiens (Human))
Karo Pharma
Curated by ChEMBL
LigandPNGBDBM50466892(CHEMBL4283871)
Affinity DataIC50: >3.00E+4nM. Assay description: Inverse agonist activity at GAL4-fused RORA LBD (unknown origin) expressed in mouse neuro2A cells assessed as inhibition of transcriptional activity ...
Ligand InfoPC cidPC sid
In DepthDetails ArticlePubMed